{"text_format":"1","workbook":"xlsx","n_sheets":10,"sheets":["注意事項1","注意事項2","注意事項(オプション)1","注意事項(オプション)2","お客様基本情報","申込情報","ドメイン情報","定義シート","カレンダー","Sheet1"],"not_rendered":{"charts":0,"images":1,"macros":1,"external_links":0,"defined_names":333,"comments":0,"pivot_tables":0},"unopened":[],"bounds":{"document_bytes":16777216,"sheet_cells":100000,"rows_first":2000,"rows_last":500,"rows_between":2000,"halvings":0,"cell_chars":16384,"cell_head_chars":4096},"cells_cut":0,"cells_raw":0,"read":"whole","date_system":"1900"}

{"sheet":"注意事項1","index":0,"n_rows":42,"n_cols":7,"rows_kept":42,"cut":false,"hidden":false,"merged":[[41,6,41,40],[1,2,1,43],[3,2,3,43],[4,2,4,43],[7,3,7,43],[8,3,8,43],[11,3,11,43],[12,3,12,43],[13,3,13,43],[17,3,17,43],[18,3,18,43],[40,6,40,40],[5,2,5,43],[9,2,9,16383],[10,2,10,16383]]}
[]
[null,null,"　　　第５種ホスティングサービス（Bizメール＆ウェブ ビジネス） \n「申込みに関する注意事項」"]
[]
[null,null,"ホスティングサービス（以下、「本サービス」）は、当社ＩＰ通信網サービス契約約款に基づきご提供させて頂いております。　本サービスの申込みに際しては、必ず弊社ホームページへ掲載されている「IP通信網サービス契約約款」、各種利用規約、及び 「重要事項に関する説明」「個人情報取り扱い」を事前にお読みいただき、承諾された上でお申込みください。契約約款は弊社各支店、営業窓口及びホームページで公開していますが、詳細な内容につきましては弊社販売担当者等にご確認ください。"]
[null,null,"本サービス申込書は「第５種ホスティングサービス（Bizメール＆ウェブ ビジネス） （以下“Bizメール＆ウェブ ビジネス”と記載）」の契約申込書となります。サービスの詳細については弊社ホームページ（http://www.ntt.com/business/services/cloud/rental-server/biz.html）で必ずご確認下さい。"]
[null,null,"・「Bizメール＆ウェブ ビジネス」の利用申込は、1プランにつき1つのホスティング契約をお申込いただきます。尚、申込者は1つの\n　ホスティング契約につき1名（組織）に限ります。\n・日本国内で住所、所在地などを確認できるお客さまに限ります。\n・OCN回線サービスの契約者だけでなく、他社のインターネット回線を使用されるお客さまについても本サービスの利用が可能です。\n　但し、本サービスにはインターネット接続（回線接続）環境の提供を含まない為、必ずインターネットに接続できる環境をご準備下さ\n　い。　　\n・本サービスは、サーバ共有型のホスティングサービスです。他のお客さまのご迷惑になる行為は制限します。\n・最低利用期間は1ヶ月と設定します。月額利用料金は日割り計算を行います。各種有料オプションについては最低利用期間を設定せ\n　ず、日割り計算を行います。\n・ホスティングサービスでは、サービスをご利用いただくための作業はお客さまにて実施していただく必要がございます。なお、設\n　定・管理にあたってのコントロールパネル等の操作につきましては各種マニュアルとカスタマサポートにてご案内させていただきま\n　す。"]
[]
[null,null,"・","本サービスご利用の場合、必ずお客さまの独自ドメインをご利用いただきます。"]
{"$rows_left_out":35}
{"sheet":"注意事項2","index":1,"n_rows":40,"n_cols":15,"rows_kept":40,"cut":false,"hidden":false,"merged":[[38,2,38,12],[38,13,38,43],[39,2,39,12],[39,13,39,43],[30,4,30,42],[33,2,33,43],[36,2,36,12],[36,13,36,43],[37,2,37,12],[37,13,37,43],[29,4,29,42],[1,2,1,43],[3,2,3,43],[4,2,4,43],[6,2,6,43],[15,2,15,13],[15,14,15,43],[16,2,16,13],[16,14,16,43],[17,2,17,13],[17,14,17,43],[28,4,28,42]]}
[]
[null,null,"取得済みのドメイン名をご利用される場合のご確認事項"]
[]
[null,null,"本ページ記載のご確認事項は、本サービスに「取得済みのドメイン名をご利用」をご希望としてお申込みする場合の確認事項です。"]
[null,null,"取得済みのドメイン名を持込みで利用する場合、本サービス申込みと同時に、そのドメイン名を管理するDNSサーバの登録申請手続きが必要です。ドメイン名の種類によって登録方法が違うため、下記《a》《b》のうち該当する項目をご確認いただき、手続き方法をご確認下さい。なお本サービスでご利用頂けるドメイン名の種類は、「注意事項1」シートの「◆ご利用ドメインについて」をご参照ください。お手続きされなかった場合、開始日を過ぎても本サービスをご利用になることができませんので、何卒ご注意下さい。"]
[]
[null,null,"お客さまで事前にDNSサーバを設置されており、引き続きそのDNSサーバを利用される場合は、本手続きの必要はありません。 DNSサーバの設置形態の変更や、指定事業者の変更が必要な場合に、以下のいずれかの手続きが必要となります。"]
[]
{"$rows_left_out":33}
{"sheet":"注意事項(オプション)1","index":2,"n_rows":63,"n_cols":33,"rows_kept":63,"cut":false,"hidden":false,"merged":[[62,3,62,43],[23,3,23,43],[26,3,26,43],[28,3,28,43],[29,4,29,43],[38,3,38,43],[40,3,40,43],[50,3,50,41],[52,4,52,37],[59,3,59,43],[60,3,60,43],[61,3,61,43],[20,2,20,19],[20,20,20,31],[20,32,20,43],[18,2,18,19],[18,20,18,31],[18,32,18,43],[19,2,19,19],[19,20,19,31],[19,32,19,43],[16,2,16,19],[16,20,16,31],[16,32,16,43],[17,2,17,19],[17,20,17,31],[17,32,17,43],[14,2,14,19],[14,20,14,31],[14,32,14,43],[15,2,15,19],[15,20,15,31],[15,32,15,43],[8,3,8,42],[12,2,12,19],[12,20,12,31],[12,32,12,43],[13,2,13,19],[13,20,13,31],[13,32,13,43],[1,2,1,43],[3,2,3,43],[4,2,4,43],[6,2,6,43],[7,3,7,42]]}
[]
[null,null,"Bizメール＆ウェブ オプションサービス申込みに関する注意事項"]
[]
[null,null,"本ページ記載の注意事項は、新オプションの「Web改ざん検知」、「自動翻訳」、「メール配信」に関する注意事項です。こちらのオプションへの申込みをご希望の場合は、必ずご確認ください。"]
[]
[]
[]
[null,null,"・","本サービスは、1ドメイン名につき1契約を締結します。"]
{"$rows_left_out":56}
{"sheet":"注意事項(オプション)2","index":3,"n_rows":69,"n_cols":20,"rows_kept":69,"cut":false,"hidden":false,"merged":[[68,3,68,43],[60,4,60,43],[61,3,61,43],[64,3,64,43],[65,3,65,43],[66,3,66,43],[67,3,67,43],[59,4,59,43],[44,2,44,43],[45,2,45,43],[46,2,46,43],[48,2,48,43],[49,3,49,43],[51,3,51,43],[52,3,52,43],[55,3,55,43],[56,3,56,39],[57,3,57,38],[58,3,58,43],[43,2,43,43],[23,3,23,43],[24,5,24,31],[25,5,25,31],[28,2,28,43],[29,2,29,43],[30,2,30,43],[31,2,31,43],[36,2,36,43],[40,2,40,43],[41,3,41,43],[42,2,42,43],[22,3,22,43],[10,2,10,43],[11,2,11,43],[12,2,12,43],[13,3,13,43],[14,2,14,43],[15,2,15,43],[16,2,16,43],[17,2,17,43],[19,3,19,43],[20,3,20,43],[21,3,21,36],[9,2,9,43],[1,2,1,43],[5,2,5,43],[6,3,6,43],[7,2,7,43],[8,2,8,43],[3,2,3,34]]}
[]
[null,null,"Bizメール＆ウェブ オプションサービス申込みに関する注意事項"]
[]
[null,null,"Bizメール＆ウェブ 自動翻訳に関する注意事項に関する注意事項"]
[]
[null,"・","本サービスは料金月の初日以外の日に、利用開始及び契約の解除があった場合は、月額で定める利用料金を日割りします。"]
[null,null,"※","Bizメール＆ウェブ ビジネス（ホスティング）と同月に開始する場合、月額利用料は初月無料とさせていただきます。"]
[null,"・","本サービスの初期・工事費用は初回月額料金請求時に合わせて請求となります。"]
{"$rows_left_out":62}
{"sheet":"お客様基本情報","index":4,"n_rows":130,"n_cols":70,"rows_kept":130,"cut":false,"hidden":false,"merged":[[103,40,103,45],[97,0,97,6],[97,7,97,8],[65,9,65,27],[64,9,64,27],[69,28,69,45],[68,28,68,45],[67,28,67,45],[65,28,65,45],[64,28,64,45],[65,3,65,6],[65,7,65,8],[66,3,66,6],[66,7,66,8],[85,7,85,8],[86,0,86,6],[89,0,89,6],[89,7,89,8],[64,3,64,6],[64,7,64,8],[88,0,88,6],[88,7,88,8],[86,7,86,8],[87,0,87,6],[61,0,61,45],[62,0,62,6],[62,7,62,8],[50,7,50,8],[56,0,56,45],[57,0,57,6],[57,7,57,8],[54,0,55,2],[58,0,58,6],[58,7,58,8],[58,9,58,27],[57,9,57,27],[57,28,57,45],[58,28,58,45],[54,28,54,45],[55,28,55,45],[52,28,52,45],[53,28,53,45],[45,28,45,45],[34,0,34,6],[34,7,34,8],[35,0,35,6],[35,7,35,8],[35,9,35,27],[34,9,34,27],[35,28,35,45],[34,28,34,45],[38,0,38,8],[38,9,38,45],[37,0,37,45],[36,0,36,45],[44,0,44,45],[40,0,40,45],[42,0,42,45],[43,0,43,45],[45,0,45,6],[45,7,45,8],[39,0,39,45],[41,0,41,45],[45,9,45,27],[24,0,24,45],[27,7,27,8],[28,0,28,6],[28,7,28,8],[29,0,29,6],[29,7,29,8],[29,9,29,27],[28,9,28,27],[27,9,27,27],[25,9,25,27],[25,28,25,45],[27,28,27,45],[28,28,28,45],[29,28,29,45],[26,0,26,6],[26,7,26,8],[26,9,26,27],[26,28,26,45],[1,0,1,45],[5,0,5,45],[8,28,8,45],[6,9,6,27],[7,9,7,27],[8,9,8,27],[4,0,4,45],[6,0,6,6],[6,7,6,8],[7,0,7,6],[7,7,7,8],[8,0,8,6],[8,7,8,8],[6,28,6,31],[7,28,7,31],[6,32,6,43],[6,44,6,45],[7,44,7,45],[7,32,7,43],[3,40,3,43],[2,1,2,16383],[12,0,12,45],[13,0,13,33],[13,34,13,45],[10,0,10,45],[11,9,11,27],[11,28,11,45],[14,9,14,33],[14,0,14,6],[14,7,14,8],[14,34,15,38],[14,39,14,45],[15,39,15,45],[11,0,11,6],[11,7,11,8],[19,34,19,45],[16,0,16,45],[17,0,17,33],[17,34,17,45],[19,9,19,33],[15,9,15,33],[15,0,15,6],[15,7,15,8],[18,0,18,6],[18,7,18,8],[19,0,19,6],[19,7,19,8],[18,9,18,27],[18,28,18,45],[20,28,20,45],[21,28,21,45],[32,0,32,6],[32,7,32,8],[33,0,33,6],[33,7,33,8],[33,9,33,27],[32,9,32,27],[33,28,33,45],[32,28,32,45],[31,0,31,45],[20,0,20,6],[20,7,20,8],[21,0,21,6],[21,7,21,8],[22,0,22,6],[22,7,22,8],[20,9,20,27],[22,9,22,27],[21,9,21,27],[22,28,22,45],[25,0,25,6],[25,7,25,8],[27,0,27,6],[48,28,48,45],[49,28,49,45],[49,0,49,6],[49,7,49,8],[50,0,50,6],[55,9,55,27],[54,9,54,27],[53,9,53,27],[52,9,52,27],[51,9,51,27],[51,7,51,8],[52,7,52,8],[53,7,53,8],[50,34,50,45],[50,9,50,33],[63,0,63,6],[63,7,63,8],[63,9,63,27],[62,9,62,27],[63,28,63,45],[62,28,62,45],[49,9,49,27],[48,9,48,27],[46,9,46,27],[51,0,51,6],[52,0,52,6],[53,0,53,6],[46,0,46,6],[46,7,46,8],[47,0,47,45],[48,0,48,6],[59,0,59,45],[48,7,48,8],[55,3,55,6],[54,3,54,6],[54,7,54,8],[55,7,55,8],[46,28,46,45],[51,28,51,45],[67,9,67,27],[67,3,67,6],[67,7,67,8],[68,3,68,6],[68,7,68,8],[69,3,69,6],[69,7,69,8],[70,0,72,2],[71,3,71,8],[72,3,72,8],[70,3,70,6],[70,7,70,8],[72,9,72,27],[69,9,69,27],[68,9,68,27],[72,28,72,45],[71,28,71,45],[70,28,70,45],[71,9,71,27],[70,9,70,27],[66,34,66,45],[66,9,66,33],[64,0,69,2],[103,0,103,5],[103,6,103,16],[103,17,103,22],[103,23,103,33],[102,0,102,5],[102,6,102,16],[102,17,102,22],[102,23,102,33],[86,34,86,45],[87,34,87,45],[86,9,86,33],[87,9,87,33],[88,9,88,33],[89,9,89,33],[88,34,88,45],[100,34,100,45],[100,9,100,33],[102,40,102,45],[100,0,100,6],[100,7,100,8],[87,7,87,8],[96,0,96,6],[96,7,96,8],[97,34,97,45],[96,9,96,33],[97,9,97,33],[98,9,98,33],[99,9,99,33],[99,0,99,6],[99,7,99,8],[99,34,99,45],[96,34,96,45],[94,0,94,6],[94,7,94,8],[94,9,94,33],[94,34,94,45],[98,0,98,6],[98,7,98,8],[98,34,98,45],[95,0,95,6],[83,7,83,8],[84,0,84,6],[84,7,84,8],[85,0,85,6],[90,7,90,8],[90,34,90,45],[78,9,78,27],[91,0,91,6],[91,7,91,8],[80,28,80,45],[79,28,79,45],[79,0,79,6],[79,7,79,8],[80,0,80,6],[80,7,80,8],[80,9,80,27],[79,9,79,27],[95,7,95,8],[93,0,93,40],[93,41,93,45],[95,34,95,45],[90,0,90,6],[89,34,89,45],[91,34,91,45],[90,9,90,33],[91,9,91,33],[95,9,95,33],[92,0,92,45],[9,9,9,27],[60,0,60,45],[84,34,84,45],[85,34,85,45],[77,0,77,6],[76,0,76,40],[76,41,76,45],[75,0,75,45],[74,0,74,45],[77,7,77,8],[77,9,77,27],[77,28,77,45],[78,28,78,45],[84,9,84,33],[85,9,85,33],[83,0,83,6],[73,0,73,45],[81,0,81,45],[82,0,82,40],[82,41,82,45],[83,34,83,45],[83,9,83,33],[78,0,78,6],[78,7,78,8]]}
[null,null,null,null,null,null,null,null,null,null,null,null,null,null,null,null,null,null,null,null,null,null,null,null,null,null,null,null,null,null,null,null,null,null,null,null,null,null,null,null,null,null,null,null,null,1]
["第5種ホスティングサービス（Bizメール&ウェブ ビジネス）新規申込書"]
[null,"NTTコミュニケーションズ株式会社の定める「ＩＰ通信網サービス契約約款」に基づき下記のとおり申し込みます。\n「申込書等にご記入いただく個人情報の取扱いについて」の内容を承諾します。\n※必ずチェックを入れてください。※チェックがない場合はお申込いただけません。　\n※　プライバシーポリシーについては右記サイトに記載されております。　http://www.ntt.com/about-us/hp/privacy.html"]
[]
["◆お客様基本情報（1/3）"]
["申込情報"]
["お申込年月日",null,null,null,null,null,null,"(必須)",null,"",null,null,null,null,null,null,null,null,null,null,null,null,null,null,null,null,null,null,{"$f":"IF(applicationArrivalDate=\"\",\"\",TEXT(applicationArrivalDate,\"aaa\"))","v":""},null,null,null,"YYYY/MM/DD（半角）",null,null,null,null,null,null,null,null,null,null,null,{"$f":"IF(applicationArrivalDate=\"\",\"\",VLOOKUP(applicationArrivalDate,カレンダー!$A$1:$C$53,3,0))","v":""}]
["ご利用開始希望日",null,null,null,null,null,null,"(必須)",null,null,null,null,null,null,null,null,null,null,null,null,null,null,null,null,null,null,null,null,{"$f":"IF(requestDate=\"\",\"\",TEXT(requestDate,\"aaa\"))","v":""},null,null,null,"YYYY/MM/DD（半角）\n※土日祝日を除く日付を記入いただきます。\n※手続き上、お客さまの開通希望年月日に添えない場合があります。",null,null,null,null,null,null,null,null,null,null,null,{"$f":"IF(requestDate=\"\",\"\",VLOOKUP(requestDate,カレンダー!$A$1:$C$53,3,0))","v":""}]
{"$rows_left_out":123}
{"sheet":"申込情報","index":5,"n_rows":61,"n_cols":5,"rows_kept":61,"cut":false,"hidden":false,"merged":[[50,3,50,4],[51,3,51,4],[52,3,52,4],[53,3,53,4],[47,0,47,4],[48,0,48,4],[49,3,49,4],[42,3,46,4],[35,0,35,4],[36,3,36,4],[37,0,37,4],[39,3,39,4],[40,3,40,4],[41,3,41,4],[38,0,38,4],[16,3,16,4],[17,0,17,4],[18,0,18,4],[25,0,34,0],[20,3,20,4],[21,3,21,4],[22,3,22,4],[23,0,23,4],[60,3,60,4],[7,3,7,4],[1,0,1,4],[3,0,3,4],[4,3,4,4],[5,0,5,4],[6,0,6,4],[19,3,19,4],[8,3,8,4],[9,3,9,4],[10,0,10,4],[11,0,11,4],[12,3,12,4],[13,3,13,4],[14,3,14,4],[15,0,15,4],[55,0,55,4],[56,0,56,4],[57,3,57,4],[58,3,58,4],[59,3,59,4]]}
[]
[{"$f":"お客様基本情報!A2","v":"第5種ホスティングサービス（Bizメール&ウェブ ビジネス）新規申込書"}]
["◆申込情報"]
["お申込情報"]
["基本プラン","（必須）","選択▼","選択してください。"]
["オプション（基本）"]
["・追加単位や上限及びご利用料金につきましては、前述の「ご利用料金」又はホームページにてご確認下さい。\n・SSLを弊社で代行設定希望の場合は、ご利用開始後にお申込いただけます。また、お客さまにて設定することも可能です。お申込方法の詳細は弊社ホームページをご確認ください。"]
["メールセキュリティサービス","（必須）","選択▼","選択してください。\n※本サービスのメール機能をご利用の場合のみ選択可能です。"]
{"$rows_left_out":54}
{"sheet":"ドメイン情報","index":6,"n_rows":218,"n_cols":35,"rows_kept":218,"cut":false,"hidden":false,"merged":[[40,7,40,8],[41,4,41,6],[41,7,41,8],[42,4,42,6],[42,7,42,8],[43,0,43,6],[43,7,43,8],[44,0,46,3],[44,4,44,6],[44,7,44,8],[45,4,45,6],[45,7,45,8],[46,4,46,6],[46,7,46,8],[40,0,42,3],[40,4,40,6],[201,0,204,3],[201,4,202,6],[205,0,207,3],[171,28,171,45],[172,4,172,6],[212,28,212,45],[208,9,208,33],[5,0,5,6],[5,7,5,8],[7,0,7,6],[7,7,7,8],[9,0,9,6],[9,7,9,8],[9,9,9,27],[7,9,7,27],[5,9,5,27],[19,4,20,6],[17,4,18,6],[17,0,20,3],[19,7,20,8],[17,7,18,8],[22,0,22,6],[22,7,22,8],[23,0,23,6],[208,34,208,45],[209,9,209,27],[209,28,211,45],[210,9,210,27],[211,9,211,27],[209,0,211,3],[209,4,209,6],[209,7,209,8],[210,4,210,6],[210,7,210,8],[211,4,211,6],[211,7,211,8],[208,0,208,6],[208,7,208,8],[205,7,205,8],[206,7,206,8],[207,7,207,8],[205,4,205,6],[206,4,206,6],[207,4,207,6],[199,0,199,45],[196,34,196,45],[197,9,197,33],[197,34,197,45],[201,7,202,8],[201,9,201,33],[201,34,202,45],[202,9,202,33],[203,4,204,6],[203,7,204,8],[203,9,203,33],[203,34,204,45],[204,9,204,33],[205,9,205,27],[205,28,207,45],[206,9,206,27],[207,9,207,27],[200,0,200,45],[191,34,191,45],[192,34,192,45],[188,0,188,6],[188,7,188,8],[191,0,192,3],[195,9,195,33],[195,34,195,45],[198,34,198,45],[195,0,196,3],[195,4,195,6],[195,7,195,8],[196,4,196,6],[196,7,196,8],[197,0,198,3],[197,4,197,6],[197,7,197,8],[198,4,198,6],[198,7,198,8],[196,9,196,33],[198,9,198,33],[166,0,166,8],[166,9,166,27],[166,28,166,45],[167,9,167,27],[167,28,167,45],[161,9,161,33],[172,7,172,8],[172,9,172,27],[172,28,172,45],[167,0,167,6],[167,7,167,8],[168,9,168,27],[168,28,168,45],[168,0,173,3],[168,4,168,6],[168,7,168,8],[169,4,169,6],[169,7,169,8],[169,9,169,33],[169,34,170,45],[170,4,170,6],[170,7,170,8],[173,4,173,6],[173,7,173,8],[105,7,105,8],[162,9,162,21],[162,22,162,33],[162,34,163,45],[164,4,165,6],[164,7,165,8],[164,9,164,21],[164,22,164,33],[164,34,165,45],[163,9,163,33],[165,9,165,33],[157,0,157,45],[147,7,147,8],[123,4,123,6],[123,7,123,8],[122,9,122,27],[122,28,122,45],[123,9,123,33],[123,34,124,45],[119,0,119,6],[119,7,119,8],[124,9,124,33],[121,9,121,27],[121,28,121,45],[124,4,124,6],[124,7,124,8],[115,34,115,45],[110,22,110,33],[111,9,111,33],[111,34,111,45],[107,9,107,21],[107,22,107,33],[107,34,108,45],[108,9,108,21],[108,22,108,33],[109,9,109,21],[122,7,122,8],[113,34,113,45],[109,34,110,45],[113,4,113,6],[113,7,113,8],[114,34,114,45],[109,22,109,33],[122,4,122,6],[125,28,125,45],[126,9,126,27],[126,28,126,45],[127,9,127,27],[127,28,127,45],[125,7,125,8],[126,4,126,6],[126,7,126,8],[127,4,127,6],[85,4,85,6],[85,7,85,8],[85,9,85,27],[85,28,85,45],[93,4,93,6],[93,7,93,8],[89,7,90,8],[89,9,89,21],[89,22,89,33],[89,34,90,45],[93,34,93,45],[93,9,93,33],[74,22,74,33],[74,34,75,45],[79,0,79,6],[79,7,79,8],[79,9,79,27],[79,28,79,45],[78,9,78,33],[73,0,73,6],[73,7,73,8],[78,34,78,45],[74,0,78,3],[74,7,75,8],[74,4,75,6],[76,4,77,6],[76,7,77,8],[78,4,78,6],[78,7,78,8],[75,9,75,21],[75,22,75,33],[67,4,67,6],[67,7,67,8],[68,4,68,6],[68,7,68,8],[69,4,69,6],[69,7,69,8],[70,9,70,33],[70,34,70,45],[66,9,66,33],[67,9,67,27],[67,28,67,45],[68,9,68,27],[68,28,68,45],[70,0,70,6],[70,7,70,8],[64,0,69,3],[57,0,57,45],[58,9,58,33],[58,34,58,45],[59,9,59,33],[59,34,59,45],[52,4,52,8],[52,9,52,27],[52,28,52,45],[56,0,56,45],[48,0,52,3],[58,0,59,3],[58,4,58,6],[58,7,58,8],[59,4,59,6],[59,7,59,8],[49,34,49,45],[50,4,50,8],[50,9,50,27],[50,28,50,45],[51,4,51,8],[51,9,51,27],[51,28,51,45],[47,9,47,27],[47,28,47,45],[48,4,48,8],[48,9,48,27],[48,28,48,45],[49,4,49,8],[49,9,49,33],[47,0,47,6],[47,7,47,8],[43,9,43,33],[43,34,43,45],[44,9,44,27],[44,28,46,45],[45,9,45,27],[40,9,40,27],[40,28,42,45],[41,9,41,27],[42,9,42,27],[46,9,46,27],[36,9,36,33],[36,34,37,45],[37,9,37,33],[38,9,38,33],[38,34,39,45],[39,9,39,33],[36,0,39,3],[36,4,37,6],[36,7,37,8],[38,4,39,6],[38,7,39,8],[33,0,33,45],[34,0,34,45],[35,0,35,8],[35,9,35,27],[35,28,35,45],[30,9,30,27],[30,28,30,45],[31,9,31,27],[31,28,31,45],[30,4,30,6],[30,7,30,8],[31,4,31,6],[31,7,31,8],[32,4,32,6],[32,7,32,8],[27,9,27,27],[27,28,27,45],[28,0,32,3],[28,9,28,27],[28,28,28,45],[29,9,29,33],[29,34,29,45],[32,9,32,27],[32,28,32,45],[28,4,28,6],[29,4,29,6],[29,7,29,8],[27,0,27,6],[27,7,27,8],[28,7,28,8],[19,9,19,33],[19,34,20,45],[21,0,21,6],[21,7,21,8],[25,9,25,27],[25,28,25,45],[26,9,26,27],[26,28,26,45],[23,9,23,27],[23,28,23,45],[24,9,24,27],[24,28,24,45],[20,9,20,33],[21,9,21,27],[21,28,21,45],[22,9,22,27],[22,28,22,45],[24,7,24,8],[25,0,25,6],[23,7,23,8],[24,0,24,6],[25,7,25,8],[26,0,26,6],[26,7,26,8],[10,0,10,45],[11,0,11,6],[11,7,11,8],[11,9,11,27],[11,28,11,45],[1,0,1,45],[4,0,4,45],[6,0,6,6],[6,7,6,8],[9,28,9,45],[7,28,7,45],[5,28,5,45],[8,28,8,45],[6,28,6,45],[6,9,6,27],[8,0,8,6],[8,7,8,8],[8,9,8,27],[15,0,15,45],[16,0,16,45],[17,9,17,33],[17,34,18,45],[18,9,18,33],[83,4,83,6],[60,4,60,6],[60,7,60,8],[60,9,60,33],[60,34,60,45],[60,0,62,3],[63,0,63,6],[65,4,65,6],[65,7,65,8],[66,4,66,6],[66,7,66,8],[64,4,64,6],[64,7,64,8],[63,7,63,8],[61,4,61,6],[61,7,61,8],[61,9,61,33],[61,34,61,45],[62,4,62,6],[62,7,62,8],[62,9,62,33],[62,34,62,45],[63,9,63,27],[63,28,63,45],[92,22,92,33],[76,9,76,21],[76,22,76,33],[76,34,77,45],[77,9,77,21],[77,22,77,33],[80,9,80,27],[80,28,80,45],[64,9,64,27],[64,28,64,45],[65,9,65,33],[65,34,66,45],[69,9,69,27],[69,28,69,45],[71,0,71,45],[72,0,72,45],[73,9,73,33],[73,34,73,45],[74,9,74,21],[80,0,80,6],[88,0,88,6],[88,7,88,8],[88,9,88,33],[88,34,88,45],[81,0,85,3],[81,4,81,6],[81,7,81,8],[81,9,81,27],[81,28,81,45],[82,34,82,45],[82,4,82,6],[86,0,86,45],[87,0,87,45],[82,7,82,8],[82,9,82,33],[80,7,80,8],[83,7,83,8],[83,9,83,27],[83,28,83,45],[84,4,84,6],[84,7,84,8],[84,9,84,27],[84,28,84,45],[94,0,94,6],[94,7,94,8],[94,9,94,27],[94,28,94,45],[95,0,95,6],[95,9,95,27],[95,28,95,45],[96,0,100,3],[96,4,96,6],[96,7,96,8],[96,9,96,27],[96,28,96,45],[97,4,97,6],[97,7,97,8],[97,9,97,33],[97,34,97,45],[98,4,98,6],[98,7,98,8],[98,9,98,27],[98,28,98,45],[99,7,99,8],[99,9,99,27],[99,28,99,45],[100,4,100,6],[89,0,93,3],[89,4,90,6],[90,9,90,21],[90,22,90,33],[91,4,92,6],[91,7,92,8],[91,9,91,21],[91,22,91,33],[91,34,92,45],[92,9,92,21],[106,9,106,27],[114,9,114,33],[106,28,106,45],[112,34,112,45],[99,4,99,6],[106,0,106,6],[106,7,106,8],[107,0,110,3],[107,4,108,6],[107,7,108,8],[109,4,110,6],[109,7,110,8],[111,0,111,6],[111,7,111,8],[103,0,103,45],[104,0,104,45],[105,9,105,27],[105,28,105,45],[100,7,100,8],[100,9,100,27],[100,28,100,45],[112,7,112,8],[112,4,112,6],[105,0,105,6],[114,0,115,3],[114,4,114,6],[114,7,114,8],[110,9,110,21],[112,0,113,3],[118,0,118,6],[118,7,118,8],[115,4,115,6],[115,7,115,8],[115,9,115,33],[116,0,117,3],[116,4,116,6],[116,7,116,8],[116,9,116,33],[112,9,112,33],[113,9,113,33],[122,0,127,3],[138,0,139,3],[116,34,116,45],[117,4,117,6],[117,7,117,8],[117,9,117,33],[117,34,117,45],[118,9,118,27],[118,28,118,45],[131,28,131,45],[132,0,132,6],[132,7,132,8],[132,9,132,27],[132,28,132,45],[131,0,131,6],[131,7,131,8],[131,9,131,27],[127,7,127,8],[119,9,119,27],[119,28,119,45],[120,0,120,6],[120,7,120,8],[120,9,120,33],[120,34,120,45],[140,0,141,3],[140,4,140,6],[140,7,140,8],[140,9,140,33],[140,34,140,45],[141,4,141,6],[147,9,147,27],[133,0,136,3],[133,4,134,6],[133,7,134,8],[133,9,133,21],[133,22,133,33],[133,34,134,45],[134,9,134,21],[134,22,134,33],[135,4,136,6],[135,7,136,8],[135,9,135,21],[135,22,135,33],[135,34,136,45],[136,9,136,21],[136,22,136,33],[137,9,137,33],[137,34,137,45],[138,4,138,6],[138,7,138,8],[138,9,138,33],[138,34,138,45],[139,4,139,6],[139,7,139,8],[139,9,139,33],[139,34,139,45],[141,7,141,8],[141,9,141,33],[141,34,141,45],[148,9,148,27],[152,9,152,27],[152,28,152,45],[147,28,147,45],[151,4,151,6],[151,7,151,8],[144,9,144,27],[144,28,144,45],[145,0,145,6],[145,7,145,8],[151,9,151,27],[151,28,151,45],[143,7,143,8],[143,9,143,33],[143,34,143,45],[160,9,160,33],[149,4,149,6],[149,7,149,8],[149,9,149,33],[149,34,150,45],[150,4,150,6],[150,9,150,33],[153,9,153,27],[153,28,153,45],[145,9,145,27],[145,28,145,45],[146,0,146,6],[146,7,146,8],[146,9,146,33],[148,28,148,45],[152,4,152,6],[152,7,152,8],[147,0,147,6],[148,0,153,3],[148,4,148,6],[148,7,148,8],[173,9,173,27],[173,28,173,45],[171,4,171,6],[171,7,171,8],[185,0,185,45],[186,0,186,45],[174,9,174,27],[174,28,174,45],[175,9,175,27],[175,28,175,45],[182,0,182,45],[181,0,181,45],[184,0,184,6],[184,7,184,8],[176,7,176,8],[183,9,183,27],[184,9,184,27],[170,9,170,33],[214,9,214,33],[217,4,217,6],[217,7,217,8],[217,9,217,27],[217,28,217,45],[174,0,174,6],[174,7,174,8],[175,0,175,6],[175,7,175,8],[176,9,176,27],[176,28,176,45],[183,7,183,8],[184,28,184,30],[184,31,184,45],[176,0,176,6],[214,34,214,45],[215,4,215,6],[215,7,215,8],[215,9,215,27],[215,28,215,45],[216,9,216,27],[216,28,216,45],[171,9,171,27],[187,28,187,45],[212,0,212,6],[212,7,212,8],[213,0,217,3],[213,4,213,6],[213,7,213,8],[216,4,216,6],[216,7,216,8],[214,4,214,6],[190,0,190,45],[192,9,192,33],[193,9,193,33],[193,34,193,45],[194,34,194,45],[193,0,194,3],[193,4,193,6],[193,7,193,8],[194,4,194,6],[194,7,194,8],[194,9,194,33],[187,7,187,8],[188,9,188,27],[188,28,188,45],[191,9,191,33],[142,34,142,45],[191,7,191,8],[214,7,214,8],[191,4,191,6],[192,4,192,6],[192,7,192,8],[189,0,189,45],[158,0,161,3],[158,4,159,6],[158,7,159,8],[158,34,159,45],[160,4,161,6],[160,7,161,8],[160,34,161,45],[158,9,158,33],[159,9,159,33],[183,0,183,6],[162,0,165,3],[162,4,163,6],[162,7,163,8],[213,9,213,27],[213,28,213,45],[212,9,212,27],[187,9,187,27],[143,4,143,6],[187,0,187,6],[121,7,121,8],[95,7,95,8],[153,7,153,8],[150,7,150,8],[153,4,153,6],[144,0,144,6],[144,7,144,8],[142,0,143,3],[142,4,142,6],[142,7,142,8],[137,0,137,6],[137,7,137,8],[125,4,125,6],[121,0,121,6],[128,0,128,45],[129,0,129,45],[130,0,130,8],[130,9,130,27],[130,28,130,45],[125,9,125,27],[146,34,146,45],[142,9,142,33]]}
[]
[{"$f":"お客様基本情報!A2","v":"第5種ホスティングサービス（Bizメール&ウェブ ビジネス）新規申込書"}]
["◆ドメイン情報（使用ドメイン情報）"]
["使用ドメイン情報"]
["【ドメイン取得代行申請希望について】\n・OCNによるドメイン取得の代行申請を希望される場合は、下記のドメイン種類にあった「ドメイン名取得代行登録申請」もご記入ください。\n・本書へ記載された内容が、JPRSが管理するwhoisデータベース上に公開されることを了承いただきます。\n【DNSサーバ設置形態について】\n＜本ホスティングサービスのDNSサーバをご利用の際のご注意＞\n・Bizメール＆ウェブ ビジネスお申込でOCN契約回線の利用がある場合、弊社より割当てたIPアドレスの設定ができません。\n＜DNSアウトソーシングプランのDNSサーバを利用の際のご注意＞\n・「DNSアウトソーシングプラン」に関しては、ドメインを管理する常時接続回線と共にお客様がお申込みになるものとなり、別途お申込が必要となります。\n【弊社からＤＮＳサーバ登録申請希望について】\n・弊社からＤＮＳサーバ登録申請を希望される場合で取得済みドメイン名を使用する場合は、下記の「ＤＮＳサーバ登録申請」もご記入ください。\n・日本語ドメインは使用できません。"]
["ドメイン取得代行申請希望",null,null,null,null,null,null,"(必須)",null,"希望する",null,null,null,null,null,null,null,null,null,null,null,null,null,null,null,null,null,null,"選択してください。"]
["使用ドメイン名",null,null,null,null,null,null,"(必須)",null,"",null,null,null,null,null,null,null,null,null,null,null,null,null,null,null,null,null,null,"半角英数５０桁まで\n※英小文字でご記入ください。"]
["ドメイン種類",null,null,null,null,null,null,"(必須)",null,"選択▼",null,null,null,null,null,null,null,null,null,null,null,null,null,null,null,null,null,null,"選択してください。"]
{"$rows_left_out":211}
{"sheet":"定義シート","index":7,"n_rows":63,"n_cols":40,"rows_kept":63,"cut":false,"hidden":true,"merged":[]}
["DEF_CODE_001","DEF_CODE_002","DEF_CODE_003","DEF_CODE_004","DEF_CODE_005","DEF_CODE_006","DEF_CODE_007","DEF_CODE_008","DEF_CODE_009","DEF_CODE_010","DEF_CODE_011","DEF_CODE_012","DEF_CODE_013","DEF_CODE_014","DEF_CODE_015","DEF_CODE_016","DEF_CODE_017","DEF_CODE_018","DEF_CODE_019","DEF_CODE_020","DEF_CODE_021","DEF_CODE_022","DEF_CODE_023","DEF_CODE_024","DEF_CODE_025","DEF_CODE_026","DEF_CODE_027","DEF_CODE_028","DEF_CODE_029","DEF_CODE_030","DEF_CODE_031","DEF_CODE_032","DEF_CODE_033","DEF_CODE_034","DEF_CODE_035","DEF_CODE_036","DEF_CODE_037","DEF_CODE_038","DEF_CODE_039","DEF_CODE_040"]
["基本プラン","メールセキュリティサービス","アカウント","追加するアカウント個数","Web改ざん検知","対象ページプラン","メンテナンス画面設置代行","自動翻訳","自動翻訳プラン","言語","翻訳ボタン設置代行","メール配信サービス","登録アドレス（宛先）追加","追加する登録アドレス（宛先）個数","新オプションの開通のご案内メール送付先コピーリスト","ドメイン種類","ドメイン代行申請希望","ドメイン種類","ＤＮＳサーバ設置形態","メールサーバ利用形態","弊社からＤＮＳサーバ登録申請希望有無","汎用/都道府県型JP_登録者名情報コピーリスト","汎用_都道府県型JP_登録者名住所コピーリスト","汎用_都道府県型JP_公開連絡窓口情報コピーリスト","汎用_都道府県型JP_登録者組織住所コピーリスト","汎用_都道府県型JP_登記地住所コピーリスト","汎用_都道府県型JP_登録担当者情報住所コピーリスト","汎用_都道府県型JP_技術連絡担当者コピーリスト","汎用_都道府県型JP_技術連絡担当者住所コピーリスト","連絡先指定","属性型JP_技術連絡担当者情報_JPNICハンドル有無","属性型JP_登録者組織住所コピーリスト","属性型JP_登記地住所コピーリスト","属性型JP_技術連絡担当者コピーリスト","属性型JP_技術連絡担当者住所コピーリスト","gTLDドメイン_登録者住所コピーリスト","ネームサーバ登録希望日指定について","ホームページ制作更新サービス","プラン","業種"]
["選択▼","選択▼","選択▼","選択▼","選択▼","選択▼","選択▼","選択▼","選択▼","選択▼","選択▼","選択▼","選択▼","選択▼","選択▼","選択▼","選択▼","選択▼","選択▼","選択▼","選択▼","選択▼","選択▼","選択▼","選択▼","選択▼","選択▼","選択▼","選択▼","選択▼","選択▼","選択▼","選択▼","選択▼","選択▼","選択▼","選択▼","選択▼","選択▼","選択▼"]
["ライト(アカウント数:10個･ディスク容量:40GB)","利用する","追加する",10,"利用する","10ページプラン","利用する","利用する","英語","英語","利用する","利用する","追加する",1000,"契約に関する連絡先と同じ","GR.JPドメイン","希望する","GR.JPドメイン","本ホスティングサービスのDNSサーバを利用","Bizメール＆ウェブ ビジネスサービスで利用するドメイン宛のメールをBizメール＆ウェブ ビジネスサーバで受信する","希望する（指定事業者をOCNにする事を承諾する）","契約に関する連絡先に同じ","契約者住所と同じ","登録者情報と同じ","契約者住所と同じ","契約者住所と同じ","契約者住所と同じ","登録担当者情報と同じ","契約者住所と同じ","契約に関する連絡先と同じ","有り（既存の情報に変更無し）","契約者住所と同じ","契約者住所と同じ","登録担当者情報と同じ","契約者住所と同じ","契約者住所と同じ","ホスティングサービスのご利用開始日にあわせて切り替えを希望する","利用する","HP制作更新サービス 選んで作るプラン","製造業"]
["ベーシック(アカウント数:100個･ディスク容量:80GB)","利用しない","追加しない",20,"利用しない","100ページプラン","利用しない","利用しない","英語/中国語/韓国語","中国語（簡体）","利用しない","利用しない","追加しない",2000,"次のとおり","NE.JPドメイン","希望しない（取得済みのドメイン名を使用する）","NE.JPドメイン","DNSアウトソーシングプランのDNSサーバを利用","Bizメール＆ウェブ ビジネスサービスで利用するドメイン宛のメールをお客様ご用意のメールサーバ（Bizメール＆ウェブ ビジネス以外のメールサーバ）で受信する","希望しない","技術担当者と同じ","次のとおり","次のとおり","次のとおり","次のとおり","次のとおり","次のとおり","次のとおり","ネットワーク技術担当者と同じ","有り（既存の情報に変更有り）","次のとおり","次のとおり","次のとおり","次のとおり","次のとおり","ホスティングサービスのご利用開始日以降を希望する","利用しない",null,"建設業"]
[null,null,null,30,null,null,null,null,"高機能","中国語（繁体）",null,null,null,3000,null,"GR.JP/NE.JPドメイン以外の属性型JPドメイン","希望しない（ドメイン名変更する 属性のみ）","GR.JP/NE.JPドメイン以外の属性型JPドメイン","お客さま側で設置／他社で契約したDNSサーバを利用",null,"NSのみ変更","次のとおり",null,null,null,null,null,null,null,"販売担当者と同じ","無し",null,null,null,null,null,null,null,null,"卸売業"]
[null,null,null,40,null,null,null,null,null,"韓国語",null,null,null,4000,null,null,null,"汎用・都道府県型JPドメイン",null,null,null,null,null,null,null,null,null,null,null,null,null,null,null,null,null,null,null,null,null,"小売業"]
[null,null,null,50,null,null,null,null,null,null,null,null,null,5000,null,null,null,"gTLDドメイン(.com/.net/.org)",null,null,null,null,null,null,null,null,null,null,null,null,null,null,null,null,null,null,null,null,null,"運輸業"]
{"$rows_left_out":56}
{"sheet":"カレンダー","index":8,"n_rows":53,"n_cols":3,"rows_kept":53,"cut":false,"hidden":true,"merged":[]}
["年月日","祝名","表示ワード"]
["2016-01-01","元日","祝日"]
["2016-01-11","成人の日","祝日"]
["2016-02-11","建国記念の日","祝日"]
["2016-03-20","春分の日","祝日"]
["2016-03-21","振替休","祝日"]
["2016-04-29","昭和の日","祝日"]
["2016-05-03","憲法記念","祝日"]
{"$rows_left_out":46}
{"sheet":"Sheet1","index":9,"n_rows":0,"n_cols":0,"rows_kept":0,"cut":false,"hidden":true,"merged":[]}